{"text_format":"1","workbook":"xlsx","n_sheets":15,"sheets":["Begruessung","Menü","Laufen","Laufkal","Tage","Wochen","Monate","Monate+Bel","Belastung","Schuhe","Kriterien","Daten","Jahre","Strecken","Bel-Kriterien"],"not_rendered":{"charts":9,"images":20,"macros":1,"external_links":0,"defined_names":42,"comments":5,"pivot_tables":0},"unopened":[],"bounds":{"document_bytes":16777216,"sheet_cells":100000,"rows_first":2000,"rows_last":500,"rows_between":2000,"halvings":0,"cell_chars":16384,"cell_head_chars":4096},"cells_cut":0,"cells_raw":0,"read":"whole","date_system":"1900"}

{"sheet":"Begruessung","index":0,"n_rows":45,"n_cols":8,"rows_kept":45,"cut":false,"hidden":false,"merged":[[20,1,20,9],[27,1,27,9],[19,1,19,9],[17,1,17,9],[38,1,38,9],[31,1,31,4],[36,1,36,9],[37,1,37,9],[39,1,39,9],[44,1,44,9],[40,1,40,9],[41,1,41,9],[42,1,42,9],[43,1,43,9],[2,1,2,9],[35,1,35,9],[8,1,8,9],[6,1,6,9],[4,1,4,9],[11,3,11,5],[11,6,11,8],[12,3,12,4],[34,1,34,9],[18,1,18,9],[14,5,14,9],[26,1,26,9],[25,1,25,9],[24,1,24,9],[23,1,23,9],[22,1,22,9]]}
[null,"Hi,"]
[]
[null,"nicht erschrecken, die Datei enthält natürlich Makros. Sie dienen bis auf 1 Ausnahme nur zum Navigieren. Die Ausnahme ist das Lösch-Makro, das alle Trainingsdaten entfernt. Man kann aber auch normal von Hand in der Datei navigieren. Es ist nichts versteckt (da fällt mir ein: Spalten im Laufkalenderblatt). Auf allen Arbeitsblättern habe ich sicherheitshalber einen Blattschutz aktiviert, aber ohne Paßwort. Kann über Extras-Schutz-Blattschutzaufheben deaktiviert werden."]
[]
[null,"Zur Demo habe ich ein paar Trainingsdaten eingegeben, damit Ihr die Berechnungen und Grafiken sehen könnt. Macht eine Sicherheitskopie, bevor Ihr mit dem Button im Hauptmenü (oder auch zu Fuß, wenn Ihr dem Makro nicht trauen wollt) die Testdaten löscht und Euch selbst versucht."]
[]
[null,"Die Kennziffern für die Belastung kann man im Blatt Kriterien beliebig ändern (z.Z. HF-Bereiche). Nur muss man dann bei der Eingabe der Trainingsläufe, genau wie bei den Schuhmodellen, natürlich genau dasselbe Kürzel verwenden. Das ist durch die automatische dropdown-Liste und Gültigkeitsprüfung gewährleistet."]
[]
[null,"Die Bildschirm-Anzeige ist für 1280x1024 Pixel eingestellt. Das läßt sich am einfachsten durch Änderung des Zoom-Faktors anpassen (Zoom-Faktor ist nur nutzbar, wenn Cursor in der Tabelle steht, d.h. nicht die Graphik markiert ist). Genug der Gebrauchsanweisungen, so kompliziert ist's wirklich nicht. Ach so, vielleicht paßt meine Skala in der Grafik nicht zu Eurem Trainingsumfang. Zum ändern einfach auf eine Skalenzahl doppelklicken und dann im Register Skalierung das Maximum verändern."]
[]
[null,"Viel Spaß"]
[null,"Uli",null,"mailto:ulrich.sauer@gmx.de",null,null,"http://www.laufen-in-witten.de"]
[null,null,null,"http://www.uli-sauer.de",null,null,"http://www.london-marathon.de"]
[]
[null,"Bei weiteren Fragen beachtet bitte die FAQ:",null,null,null,"http://www.uli-sauer.de/laufen/training/faq_lauftagebuch.htm"]
{"$rows_left_out":31}
{"sheet":"Menü","index":1,"n_rows":19,"n_cols":2,"rows_kept":19,"cut":false,"hidden":false,"merged":[[2,1,2,8],[10,1,10,8],[18,1,18,8]]}
[" "]
[]
[null,"Zur Datenanzeige"]
[]
[]
[]
[]
[]
[]
[]
[null,"Zur regelmäßigen Dateneingabe im Kalender"]
[]
[]
[]
[]
{"$rows_left_out":5}
{"sheet":"Laufen","index":2,"n_rows":27,"n_cols":12,"rows_kept":27,"cut":false,"hidden":false,"merged":[[29,1,29,5]]}
[null,{"$f":"+\"Laufen \"&Daten!D3","v":"Laufen 2021"},"Stand",{"$f":"TODAY()","v":"2020-11-05"},"km","Anzahl","hh:mm:ss",null,"verletzt/krank"]
[null,"im Jahr insgesamt",null,null,{"$f":"DSUM(laufkalender,Laufkal!F5,Kriterien!$A$6:$B$7)","v":22},{"$f":"DCOUNT(laufkalender,Laufkal!F5,Kriterien!A6:B7)-L26","v":2},{"$f":"DSUM(laufkalender,Laufkal!L5,Kriterien!A6:B7)/24/60","v":8.3159722222222218E-2},null,{"$f":"DCOUNT(laufkalender,Laufkal!AH5,Kriterien!$A$6:$B$7)","v":1}]
[]
[null,"Durchschnitt pro Monat",null,null,{"$f":"+E2/Daten!D11","v":{"$error":"#DIV/0!"}},{"$f":"+F2/Daten!D11","v":{"$error":"#DIV/0!"}},{"$f":"+G2/Daten!D11","v":{"$error":"#DIV/0!"}},null,{"$f":"+I2/Daten!D11","v":{"$error":"#DIV/0!"}}]
[null,"Durchschnitt pro Woche",null,null,{"$f":"(+E2+Daten!I8+Daten!I12)/Daten!D10","v":{"$error":"#DIV/0!"}},{"$f":"(+F2+Daten!I9+Daten!I13)/Daten!D10","v":{"$error":"#DIV/0!"}},{"$f":"+G2/Daten!D10","v":{"$error":"#DIV/0!"}},null,{"$f":"+I2/Daten!D10","v":{"$error":"#DIV/0!"}}]
[null,"Durchschnitt pro Tag",null,null,{"$f":"+E2/Daten!D9","v":{"$error":"#DIV/0!"}},{"$f":"+F2/Daten!D9","v":{"$error":"#DIV/0!"}},{"$f":"+G2/Daten!D9","v":{"$error":"#DIV/0!"}}]
[null,"Durchschnitt pro Lauf",null,null,{"$f":"+E2/F2","v":11},null,{"$f":"+G2/F2","v":"00:59:52.500"},null,"ges. seit 01/2001"]
[null,"Durchschnittstempo km/Std - m/sec - min/km",null,null,{"$f":"+E2/(G2*24)","v":11.022964509394573},{"$f":"+E2*1000/(G2*24*60*60)","v":3.0619345859429372},{"$f":"+G2/E2","v":"00:05:26.591"},null,{"$f":"+I2+Daten!E28","v":1}]
[null,"längster Lauf",null,null,{"$f":"DMAX(laufkalender,Laufkal!F5,Kriterien!A6:A7)","v":10},null,{"$f":"DMAX(laufkalender,Laufkal!L5,Kriterien!A6:B7)/24/60","v":3.9756944444444442E-2}]
[null,"kürzester Lauf",null,null,{"$f":"DMIN(laufkalender,Laufkal!F5,Kriterien!A6:A7)","v":2},null,{"$f":"DMIN(laufkalender,Laufkal!L5,Kriterien!A6:B7)/24/60","v":9.7222222222222224E-3},null,"gesamt-km"]
[null,"weicher Boden insgesamt",null,null,{"$f":"+Laufkal!AF739","v":9},{"$f":"+E11/E2","v":0.40909090909090912},null,null,"seit 11/85"]
[null,"harter Boden insgesamt",null,null,{"$f":"+Laufkal!AG739","v":13},{"$f":"+E12/E2","v":0.59090909090909094},null,null,{"$f":"+Daten!C28+Laufen!E2","v":22}]
[]
[null,"Schuhe","Kauf","Anzahl","km","% km","km ges.",null,"Belastung","Anzahl","km","% km"]
[null,{"$f":"+Kriterien!A12","v":"Schuh 1"},{"$f":"IF(+Kriterien!C12=\"\",\"\",+Kriterien!C12)","v":""},{"$f":"DCOUNT(laufkalender,Laufkal!F5,Kriterien!A61:A62)","v":1},{"$f":"DSUM(laufkalender,Laufkal!F5,Kriterien!A61:A62)","v":10},{"$f":"+E15/$E$26","v":0.45454545454545453},{"$f":"+E15+Kriterien!D12","v":10},null,{"$f":"+Kriterien!A26","v":"Wettkampf"},{"$f":"DCOUNT(laufkalender,Laufkal!F5,Kriterien!G43:G44)","v":1},{"$f":"DSUM(laufkalender,Laufkal!F5,Kriterien!G43:G44)","v":10},{"$f":"+K15/$K$21","v":0.45454545454545453}]
{"$rows_left_out":13}
{"sheet":"Laufkal","index":3,"n_rows":741,"n_cols":34,"rows_kept":741,"cut":false,"hidden":false,"merged":[[739,31,739,32],[0,0,0,2],[0,5,0,12],[739,27,739,28],[740,27,740,28],[0,16,0,17],[1,6,1,10],[1,19,1,20],[0,22,0,23],[1,21,1,22],[1,23,1,24]]}
[{"$f":"+Daten!D3","v":2021},null,null,null,null,{"$f":"+\"Jahr: \"&+ROUND(Laufen!E2,1)&\" km\"","v":"Jahr: 22 km"},null,null,null,null,null,null,null,"akt. Monat:",null,null,{"$f":"IF(+Daten!D3=YEAR(Daten!D8),VLOOKUP(aktuellermonat,Daten!C33:D44,2),\"---\")","v":"---"},null,"km","Vormonat:",null,null,{"$f":"IF(aktuellermonat<=1,\"---\",VLOOKUP(aktuellermonat-1,Daten!C33:D44,2))","v":"---"},null,"km"]
[null,"Mo",null,null,null,"km","Laufzeit",null,null,null,null,"min","Ø","Ø","Be-","HF","HF","Greif","Sch-","Anteil",null,"verletzt/krk.",null,"Gewicht",null,null,"Zs","Tg","Wo","Wo","Zs","km","km","Wert"]
[null,"nat",null,null,null,null,null,null,null,null,null,null,"min/","km/","las-","Ø","%von","Pkte","uh","weich","hart","Ein","Anz.","in kg","BMI",null,"fsg","sum","sum","nr","fsg","weich","hart","Mu"]
["Datum",null,"Tag",null,null,null,"h",":","mm",":","ss",null,"km","Std","tung",null,"max",null,null,"1-10",null,"gabe","lfd.J.",null,null,"Kommentar",null,null,null,null,null,null,null,"bu"]
["datum","mo","tag","m","so","km","h",null,"mm",null,"ss","min","min/km","km/std","bel","dhf","%HF","gpkt","Schuh","weich","hart",6,null,null,null,"kommentar","Zus",null,"wosum","wonr","Zusfsg","kmw","kmh","WeMu"]
[{"$f":"DATE(Daten!D3,1,1)","v":"2021-01-01"},{"$f":"MONTH(A6)","v":1},{"$f":"WEEKDAY(A6)","v":"1900-01-06"},1,{"$f":"IF(D6=2,IF(C6=1,1,2),0)","v":0},null,null,":",null,":",null,{"$f":"IF((+G6*60+I6+K6/60)>0,G6*60+I6+K6/60,\" \")","v":" "},{"$f":"IF(+F6>0,+L6/F6/24/60,\" \")","v":" "},{"$f":"IF(F6>0,+F6/(L6/60),\"\")","v":""},null,null,{"$f":"IF(maxhf<100,0,IF(ISBLANK(P6)=\"WAHR\",P6,P6/maxhf)*100)","v":0},{"$f":"IF(F6>0,IF(P6>0,+F6*(F6*1000/(G6*60+I6+K6/60))/(maxhf-P6)*(maxhf/220),\"\"),\"\")","v":""},null,null,{"$f":"IF(COUNTBLANK(T6)=1,\"\",IF(T6=\"10\",\"0\",10-T6))","v":""},null,{"$f":"IF(V6<>\"\",SUM($AH$6:AH6)/10,\"\")","v":""},null,{"$f":"IF(X6>0,+X6/Daten!$I$18^2,\"\")","v":""},null,null,null,{"$f":"IF(WEEKDAY(A6)=1,IF(E6=1,VLOOKUP(AD6,Daten!$C$50:$D$103,2),\" \"),\"\")","v":""},{"$f":"erstewochennr","v":0},{"$f":"IF(F6>0,IF(D6=2,IF((AA5+AA6)>0,1,0),0),0)","v":0},{"$f":"+T6/10*F6","v":0},{"$f":"IF(COUNTBLANK(T6)=1,0,+U6/10*F6)","v":0},{"$f":"IF(V6<>\"\",10,\"\")","v":""}]
[{"$f":"+A6","v":"2021-01-01"},{"$f":"MONTH(A7)","v":1},{"$f":"WEEKDAY(A7)","v":"1900-01-06"},2,{"$f":"IF(D7=2,IF(C7=1,1,2),0)","v":2},null,null,":",null,":",null,{"$f":"IF((+G7*60+I7+K7/60)>0,G7*60+I7+K7/60,\" \")","v":" "},{"$f":"IF(+F7>0,+L7/F7/24/60,\" \")","v":" "},{"$f":"IF(F7>0,+F7/(L7/60),\"\")","v":""},null,null,0,"",null,null,"","v",{"$f":"IF(V7<>\"\",SUM($AH$6:AH7)/10,\"\")","v":1},null,{"$f":"IF(X7>0,+X7/Daten!$I$18^2,\"\")","v":""},null,null,{"$f":"IF(D7=2,+F7+F6,0)","v":0},{"$f":"IF(WEEKDAY(A7)=1,IF(E7=1,VLOOKUP(AD7,Daten!$C$50:$D$103,2),\" \"),\"\")","v":""},{"$f":"erstewochennr","v":0},0,0,0,{"$f":"IF(V7<>\"\",10,\"\")","v":10}]
[{"$f":"+A6+1","v":"2021-01-02"},1,"1900-01-07",1,0,null,null,":",null,":",null," "," ","",null,null,0,"",null,null,"",null,{"$f":"IF(V8<>\"\",SUM($AH$6:AH8)/10,\"\")","v":""},null,{"$f":"IF(X8>0,+X8/Daten!$I$18^2,\"\")","v":""},null,null,0,{"$f":"IF(WEEKDAY(A8)=1,IF(E8=1,VLOOKUP(AD8,Daten!$C$50:$D$103,2),\" \"),\"\")","v":""},{"$f":"IF(WEEKDAY(A8)=2,IF(D8=1,AD7+1,AD7),AD7)","v":0},0,0,0,""]
[{"$f":"+A8","v":"2021-01-02"},1,"1900-01-07",2,2,10,null,":",57,":",15,57.25,"00:05:43.500",10.480349344978166,"L>65%",115,73.248407643312092,29.679199984876838,"s1",9,1,null,{"$f":"IF(V9<>\"\",SUM($AH$6:AH9)/10,\"\")","v":""},66,{"$f":"IF(X9>0,+X9/Daten!$I$18^2,\"\")","v":21.306818181818183},"Testeingabe",null,10,{"$f":"IF(WEEKDAY(A9)=1,IF(E9=1,VLOOKUP(AD9,Daten!$C$50:$D$103,2),\" \"),\"\")","v":""},0,0,9,1,""]
[{"$f":"+A8+1","v":"2021-01-03"},1,"1900-01-01",1,0,null,null,":",null,":",null," "," ","",null,null,0,"",null,null,"",null,{"$f":"IF(V10<>\"\",SUM($AH$6:AH10)/10,\"\")","v":""},null,{"$f":"IF(X10>0,+X10/Daten!$I$18^2,\"\")","v":""},null,null,0,{"$f":"IF(WEEKDAY(A10)=1,IF(E10=1,VLOOKUP(AD10,Daten!$C$50:$D$103,2),\" \"),\"\")","v":" "},0,0,0,0,""]
[{"$f":"+A10","v":"2021-01-03"},1,"1900-01-01",2,1,null,null,":",null,":",null," "," ","",null,null,0,"",null,null,"",null,{"$f":"IF(V11<>\"\",SUM($AH$6:AH11)/10,\"\")","v":""},null,{"$f":"IF(X11>0,+X11/Daten!$I$18^2,\"\")","v":""},null,null,0,{"$f":"IF(WEEKDAY(A11)=1,IF(E11=1,VLOOKUP(AD11,Daten!$C$50:$D$103,2),\" \"),\"\")","v":10},0,0,0,0,""]
[{"$f":"+A10+1","v":"2021-01-04"},1,"1900-01-02",1,0,null,null,":",null,":",null," "," ","",null,null,0,"",null,null,"",null,{"$f":"IF(V12<>\"\",SUM($AH$6:AH12)/10,\"\")","v":""},null,{"$f":"IF(X12>0,+X12/Daten!$I$18^2,\"\")","v":""},null,null,0,{"$f":"IF(WEEKDAY(A12)=1,IF(E12=1,VLOOKUP(AD12,Daten!$C$50:$D$103,2),\" \"),\"\")","v":""},1,0,0,0,""]
[{"$f":"+A12","v":"2021-01-04"},1,"1900-01-02",2,2,null,null,":",null,":",null," "," ","",null,null,0,"",null,null,"",null,{"$f":"IF(V13<>\"\",SUM($AH$6:AH13)/10,\"\")","v":""},null,{"$f":"IF(X13>0,+X13/Daten!$I$18^2,\"\")","v":""},null,null,0,{"$f":"IF(WEEKDAY(A13)=1,IF(E13=1,VLOOKUP(AD13,Daten!$C$50:$D$103,2),\" \"),\"\")","v":""},1,0,0,0,""]
[{"$f":"+A12+1","v":"2021-01-05"},1,"1900-01-03",1,0,10,null,":",48,":",30,48.5,"00:04:51",12.371134020618557,"w",140,89.171974522292999,86.553834279728761,"s2",0,10,null,{"$f":"IF(V14<>\"\",SUM($AH$6:AH14)/10,\"\")","v":""},null,{"$f":"IF(X14>0,+X14/Daten!$I$18^2,\"\")","v":""},"Testeingabe Wettkampf",1,0,{"$f":"IF(WEEKDAY(A14)=1,IF(E14=1,VLOOKUP(AD14,Daten!$C$50:$D$103,2),\" \"),\"\")","v":""},1,0,0,10,""]
[{"$f":"+A14","v":"2021-01-05"},1,"1900-01-03",2,2,2,null,":",14,":",0,14,"00:07:00",8.5714285714285712,"R<65%",110,70.063694267515913,4.338214976512849,"s2",0,10,null,{"$f":"IF(V15<>\"\",SUM($AH$6:AH15)/10,\"\")","v":""},null,{"$f":"IF(X15>0,+X15/Daten!$I$18^2,\"\")","v":""},"Ein-/Auslaufen",1,12,{"$f":"IF(WEEKDAY(A15)=1,IF(E15=1,VLOOKUP(AD15,Daten!$C$50:$D$103,2),\" \"),\"\")","v":""},1,1,0,2,""]
{"$rows_left_out":727}
{"sheet":"Tage","index":4,"n_rows":0,"n_cols":0,"rows_kept":0,"cut":false,"hidden":false,"merged":[]}

{"sheet":"Wochen","index":5,"n_rows":0,"n_cols":0,"rows_kept":0,"cut":false,"hidden":false,"merged":[]}

{"sheet":"Monate","index":6,"n_rows":0,"n_cols":0,"rows_kept":0,"cut":false,"hidden":false,"merged":[]}

{"sheet":"Monate+Bel","index":7,"n_rows":0,"n_cols":0,"rows_kept":0,"cut":false,"hidden":false,"merged":[]}

{"sheet":"Belastung","index":8,"n_rows":0,"n_cols":0,"rows_kept":0,"cut":false,"hidden":false,"merged":[]}

{"sheet":"Schuhe","index":9,"n_rows":0,"n_cols":0,"rows_kept":0,"cut":false,"hidden":false,"merged":[]}

{"sheet":"Kriterien","index":10,"n_rows":196,"n_cols":7,"rows_kept":196,"cut":false,"hidden":false,"merged":[[24,2,24,3]]}
["Erfassung individueller Daten ist nur in",null,null,"Feldern","notwendig."]
[]
[]
["Kriterien für"]
["Gesamtsummen Laufen"]
["datum","datum"]
[]
[]
[]
[]
["Schuhname","Kürzel","Kaufdatum","km Vorjahre"]
["Schuh 1","s1"]
["Schuh 2","s2"]
["Schuh 3","s3"]
["Schuh 4","s4"]
{"$rows_left_out":182}
{"sheet":"Daten","index":11,"n_rows":105,"n_cols":10,"rows_kept":105,"cut":false,"hidden":false,"merged":[[30,2,30,6],[46,2,46,6]]}
["Erfassung individueller Daten ist nur in den ",null,null,null,"Feldern","notwendig."]
[]
[null,null,"Jahr eingeben:",2021,{"$f":"IF(D8<D6,\"Jahr hat noch nicht begonnen!\",\"\")","v":"Jahr hat noch nicht begonnen!"}]
[null,null,"Anfangstag:",1]
[null,null,"Anfangsmonat:",1,null,null,"Wochen-Nummer des 01.01.",null,{"$f":"IF(I7>3,0,1)","v":0}," (Woche Nr. 1 muss 4 Wochentage haben)"]
[null,null,"Jahresbeginn",{"$f":"DATE(D3,1,1)","v":"2021-01-01"},null,null,"Wochentag Jahresbeginn",null,{"$f":"WEEKDAY(D6)","v":"1900-01-06"}]
[null,null,"Anfang/Ende",{"$f":"DATE(D3,D5,D4)","v":"2021-01-01"},{"$f":"DATE(D3,12,31)","v":"2021-12-31"},null,"Wochentage vor Jahresbeginn",null,{"$f":"IF(WEEKDAY(D6)=1,6,WEEKDAY(D6)-2)","v":4}]
[null,null,"heute",{"$f":"TODAY()","v":"2020-11-05"},{"$f":"IF(D8>E7,E7-D7+1,D8-D7+1)","v":-56},{"$f":"MONTH(D8)-D5","v":10},"darin gelaufene km Vorjahr"]
[null,null,"Anzahl Tage",{"$f":"IF(D8<D6,0,IF(E8>E7,E8-D8+1,E8))","v":0},null,null,"Anzahl Läufe Vorjahr"]
[null,null,"Anzahl Wochen",{"$f":"IF(D8<D6,0,IF(D8<E7,(D9+I7)/7,(+D9+I7+I11)/7))","v":0},null,null,"Wochentag Jahresende",null,{"$f":"WEEKDAY(E7)","v":"1900-01-06"}]
[null,null,"Anzahl Monate",{"$f":"IF(D8<D6,0,IF(D8>E7,12,(D8-D7+1)/30))","v":0},null,null,"Wochentage nach Jahresende",null,{"$f":"IF(WEEKDAY(DATE(D3,12,31))=1,0,8-WEEKDAY(DATE(D3,12,31)))","v":2}]
[null,null,"Anzahljahrestage",{"$f":"IF(D8<D6,0,IF(D8>E7,E7-D6+1,D8-D6+1))","v":0},null,null,"darin gelaufene km Folgejahr"]
[null,null,"aktueller Monat",{"$f":"IF(D3=YEAR(tagesdatum),MONTH(tagesdatum),0)","v":0},null,null,"Anzahl Läufe Folgejahr"]
[]
[null,null,null,null,null,null,"Infos zum Body Mass Index zum Beispiel bei:",null,null,"Uni Hohenheim"]
{"$rows_left_out":91}
{"sheet":"Jahre","index":12,"n_rows":0,"n_cols":0,"rows_kept":0,"cut":false,"hidden":false,"merged":[]}

{"sheet":"Strecken","index":13,"n_rows":24,"n_cols":1,"rows_kept":24,"cut":false,"hidden":false,"merged":[]}
["Laufstrecken"]
["Strecke 1"]
["Strecke 2"]
["Strecke 3"]
["Strecke 4"]
["Strecke 5"]
["Strecke 6"]
["Strecke 7"]
["Strecke 8"]
["Strecke 9"]
["Strecke 10"]
[]
["Distanzen"]
[5]
[10]
{"$rows_left_out":10}
{"sheet":"Bel-Kriterien","index":14,"n_rows":28,"n_cols":27,"rows_kept":28,"cut":false,"hidden":false,"merged":[]}
["Kriterien und Formeln zur Berechnung der Belastungen je Monat"]
["In diesem Blatt sind keine individuellen Änderungen notwendig.",null,null,null,null,null,null,null,null,null,null,null,null,null,1,2,3,4,5,6,7,8,9,10,11,12,"Sum"]
["mo","bel","mo","bel","mo","bel","mo","bel","mo","bel","mo","bel",null,{"$f":"+Kriterien!B26","v":"W"},{"$f":"DSUM(laufkalender,Laufkal!F5,A3:B4)","v":10},{"$f":"DSUM(laufkalender,Laufkal!$F$5,A5:B6)","v":0},{"$f":"DSUM(laufkalender,Laufkal!$F$5,A7:B8)","v":0},{"$f":"DSUM(laufkalender,Laufkal!$F$5,A9:B10)","v":0},{"$f":"DSUM(laufkalender,Laufkal!$F$5,A11:B12)","v":0},{"$f":"DSUM(laufkalender,Laufkal!$F$5,A13:B14)","v":0},{"$f":"DSUM(laufkalender,Laufkal!$F$5,A15:B16)","v":0},{"$f":"DSUM(laufkalender,Laufkal!$F$5,A17:B18)","v":0},{"$f":"DSUM(laufkalender,Laufkal!$F$5,A19:B20)","v":0},{"$f":"DSUM(laufkalender,Laufkal!$F$5,A21:B22)","v":0},{"$f":"DSUM(laufkalender,Laufkal!$F$5,A23:B24)","v":0},{"$f":"DSUM(laufkalender,Laufkal!$F$5,A25:B26)","v":0},{"$f":"SUM(O3:Z3)","v":10}]
[1,{"$f":"+Kriterien!$B$26","v":"W"},1,{"$f":"+Kriterien!$B$27","v":"T >90%"},1,{"$f":"+Kriterien!$B$28","v":"G2>80%"},1,{"$f":"+Kriterien!$B$29","v":"G1>70%"},1,{"$f":"+Kriterien!$B$30","v":"L>65%"},1,{"$f":"+Kriterien!$B$31","v":"R<65%"},null,{"$f":"+Kriterien!B27","v":"T >90%"},{"$f":"DSUM(laufkalender,Laufkal!$F$5,C3:D4)","v":0},{"$f":"DSUM(laufkalender,Laufkal!$F$5,C5:D6)","v":0},{"$f":"DSUM(laufkalender,Laufkal!$F$5,C7:D8)","v":0},{"$f":"DSUM(laufkalender,Laufkal!$F$5,C9:D10)","v":0},{"$f":"DSUM(laufkalender,Laufkal!$F$5,C11:D12)","v":0},{"$f":"DSUM(laufkalender,Laufkal!$F$5,C13:D14)","v":0},{"$f":"DSUM(laufkalender,Laufkal!$F$5,C15:D16)","v":0},{"$f":"DSUM(laufkalender,Laufkal!$F$5,C17:D18)","v":0},{"$f":"DSUM(laufkalender,Laufkal!$F$5,C19:D20)","v":0},{"$f":"DSUM(laufkalender,Laufkal!$F$5,C21:D22)","v":0},{"$f":"DSUM(laufkalender,Laufkal!$F$5,C23:D24)","v":0},{"$f":"DSUM(laufkalender,Laufkal!$F$5,C25:D26)","v":0},{"$f":"SUM(O4:Z4)","v":0}]
["mo","bel","mo","bel","mo","bel","mo","bel","mo","bel","mo","bel",null,{"$f":"+Kriterien!B28","v":"G2>80%"},{"$f":"DSUM(laufkalender,Laufkal!$F$5,E3:F4)","v":0},{"$f":"DSUM(laufkalender,Laufkal!$F$5,E5:F6)","v":0},{"$f":"DSUM(laufkalender,Laufkal!$F$5,E7:F8)","v":0},{"$f":"DSUM(laufkalender,Laufkal!$F$5,E9:F10)","v":0},{"$f":"DSUM(laufkalender,Laufkal!$F$5,E11:F12)","v":0},{"$f":"DSUM(laufkalender,Laufkal!$F$5,E13:F14)","v":0},{"$f":"DSUM(laufkalender,Laufkal!$F$5,E15:F16)","v":0},{"$f":"DSUM(laufkalender,Laufkal!$F$5,E17:F18)","v":0},{"$f":"DSUM(laufkalender,Laufkal!$F$5,E19:F20)","v":0},{"$f":"DSUM(laufkalender,Laufkal!$F$5,E21:F22)","v":0},{"$f":"DSUM(laufkalender,Laufkal!$F$5,E23:F24)","v":0},{"$f":"DSUM(laufkalender,Laufkal!$F$5,E25:F26)","v":0},0]
[2,{"$f":"+Kriterien!$B$26","v":"W"},2,{"$f":"+Kriterien!$B$27","v":"T >90%"},2,{"$f":"+Kriterien!$B$28","v":"G2>80%"},2,{"$f":"+Kriterien!$B$29","v":"G1>70%"},2,{"$f":"+Kriterien!$B$30","v":"L>65%"},2,{"$f":"+Kriterien!$B$31","v":"R<65%"},null,{"$f":"+Kriterien!B29","v":"G1>70%"},{"$f":"DSUM(laufkalender,Laufkal!$F$5,G3:H4)","v":0},{"$f":"DSUM(laufkalender,Laufkal!$F$5,G5:H6)","v":0},{"$f":"DSUM(laufkalender,Laufkal!$F$5,G7:H8)","v":0},{"$f":"DSUM(laufkalender,Laufkal!$F$5,G9:H10)","v":0},{"$f":"DSUM(laufkalender,Laufkal!$F$5,G11:H12)","v":0},{"$f":"DSUM(laufkalender,Laufkal!$F$5,G13:H14)","v":0},{"$f":"DSUM(laufkalender,Laufkal!$F$5,G15:H16)","v":0},{"$f":"DSUM(laufkalender,Laufkal!$F$5,G17:H18)","v":0},{"$f":"DSUM(laufkalender,Laufkal!$F$5,G19:H20)","v":0},{"$f":"DSUM(laufkalender,Laufkal!$F$5,G21:H22)","v":0},{"$f":"DSUM(laufkalender,Laufkal!$F$5,G23:H24)","v":0},{"$f":"DSUM(laufkalender,Laufkal!$F$5,G25:H26)","v":0},0]
["mo","bel","mo","bel","mo","bel","mo","bel","mo","bel","mo","bel",null,{"$f":"+Kriterien!B30","v":"L>65%"},{"$f":"DSUM(laufkalender,Laufkal!$F$5,I3:J4)","v":10},{"$f":"DSUM(laufkalender,Laufkal!$F$5,I5:J6)","v":0},{"$f":"DSUM(laufkalender,Laufkal!$F$5,I7:J8)","v":0},{"$f":"DSUM(laufkalender,Laufkal!$F$5,I9:J10)","v":0},{"$f":"DSUM(laufkalender,Laufkal!$F$5,I11:J12)","v":0},{"$f":"DSUM(laufkalender,Laufkal!$F$5,I13:J14)","v":0},{"$f":"DSUM(laufkalender,Laufkal!$F$5,I15:J16)","v":0},{"$f":"DSUM(laufkalender,Laufkal!$F$5,I17:J18)","v":0},{"$f":"DSUM(laufkalender,Laufkal!$F$5,I19:J20)","v":0},{"$f":"DSUM(laufkalender,Laufkal!$F$5,I21:J22)","v":0},{"$f":"DSUM(laufkalender,Laufkal!$F$5,I23:J24)","v":0},{"$f":"DSUM(laufkalender,Laufkal!$F$5,I25:J26)","v":0},10]
[3,{"$f":"+Kriterien!$B$26","v":"W"},3,{"$f":"+Kriterien!$B$27","v":"T >90%"},3,{"$f":"+Kriterien!$B$28","v":"G2>80%"},3,{"$f":"+Kriterien!$B$29","v":"G1>70%"},3,{"$f":"+Kriterien!$B$30","v":"L>65%"},3,{"$f":"+Kriterien!$B$31","v":"R<65%"},null,{"$f":"+Kriterien!B31","v":"R<65%"},{"$f":"DSUM(laufkalender,Laufkal!$F$5,K3:L4)","v":2},{"$f":"DSUM(laufkalender,Laufkal!$F$5,K5:L6)","v":0},{"$f":"DSUM(laufkalender,Laufkal!$F$5,K7:L8)","v":0},{"$f":"DSUM(laufkalender,Laufkal!$F$5,K9:L10)","v":0},{"$f":"DSUM(laufkalender,Laufkal!$F$5,K11:L12)","v":0},{"$f":"DSUM(laufkalender,Laufkal!$F$5,K13:L14)","v":0},{"$f":"DSUM(laufkalender,Laufkal!$F$5,K15:L16)","v":0},{"$f":"DSUM(laufkalender,Laufkal!$F$5,K17:L18)","v":0},{"$f":"DSUM(laufkalender,Laufkal!$F$5,K19:L20)","v":0},{"$f":"DSUM(laufkalender,Laufkal!$F$5,K21:L22)","v":0},{"$f":"DSUM(laufkalender,Laufkal!$F$5,K23:L24)","v":0},{"$f":"DSUM(laufkalender,Laufkal!$F$5,K25:L26)","v":0},2]
["mo","bel","mo","bel","mo","bel","mo","bel","mo","bel","mo","bel",null,"Sum",{"$f":"SUM(O3:O8)","v":22},{"$f":"SUM(P3:P8)","v":0},0,0,0,0,0,0,0,0,0,0,22]
[4,{"$f":"+Kriterien!$B$26","v":"W"},4,{"$f":"+Kriterien!$B$27","v":"T >90%"},4,{"$f":"+Kriterien!$B$28","v":"G2>80%"},4,{"$f":"+Kriterien!$B$29","v":"G1>70%"},4,{"$f":"+Kriterien!$B$30","v":"L>65%"},4,{"$f":"+Kriterien!$B$31","v":"R<65%"}]
["mo","bel","mo","bel","mo","bel","mo","bel","mo","bel","mo","bel",null,{"$f":"+Kriterien!B26","v":"W"},{"$f":"IF(O3=0,0,+O3/O9)","v":0.45454545454545453},{"$f":"IF(P3=0,0,+P3/P9)","v":0},0,0,0,0,0,0,0,0,0,0,{"$f":"+AA3/AA9","v":0.45454545454545453}]
[5,{"$f":"+Kriterien!$B$26","v":"W"},5,{"$f":"+Kriterien!$B$27","v":"T >90%"},5,{"$f":"+Kriterien!$B$28","v":"G2>80%"},5,{"$f":"+Kriterien!$B$29","v":"G1>70%"},5,{"$f":"+Kriterien!$B$30","v":"L>65%"},5,{"$f":"+Kriterien!$B$31","v":"R<65%"},null,{"$f":"+Kriterien!B27","v":"T >90%"},{"$f":"IF(O4=0,0,+O4/O9)","v":0},{"$f":"IF(P4=0,0,+P4/P9)","v":0},0,0,0,0,0,0,0,0,0,0,{"$f":"+AA4/AA9","v":0}]
["mo","bel","mo","bel","mo","bel","mo","bel","mo","bel","mo","bel",null,{"$f":"+Kriterien!B28","v":"G2>80%"},{"$f":"IF(O5=0,0,+O5/O9)","v":0},{"$f":"IF(P5=0,0,+P5/P9)","v":0},0,0,0,0,0,0,0,0,0,0,{"$f":"+AA5/AA9","v":0}]
[6,{"$f":"+Kriterien!$B$26","v":"W"},6,{"$f":"+Kriterien!$B$27","v":"T >90%"},6,{"$f":"+Kriterien!$B$28","v":"G2>80%"},6,{"$f":"+Kriterien!$B$29","v":"G1>70%"},6,{"$f":"+Kriterien!$B$30","v":"L>65%"},6,{"$f":"+Kriterien!$B$31","v":"R<65%"},null,{"$f":"+Kriterien!B29","v":"G1>70%"},{"$f":"IF(O6=0,0,+O6/O9)","v":0},{"$f":"IF(P6=0,0,+P6/P9)","v":0},0,0,0,0,0,0,0,0,0,0,{"$f":"+AA6/AA9","v":0}]
["mo","bel","mo","bel","mo","bel","mo","bel","mo","bel","mo","bel",null,{"$f":"+Kriterien!B30","v":"L>65%"},{"$f":"IF(O7=0,0,+O7/O9)","v":0.45454545454545453},{"$f":"IF(P7=0,0,+P7/P9)","v":0},0,0,0,0,0,0,0,0,0,0,{"$f":"+AA7/AA9","v":0.45454545454545453}]
{"$rows_left_out":13}