{"text_format":"1","workbook":"xlsx","n_sheets":17,"sheets":["Begruessung","Menue","Laufen","Laufkal","Radeln","Radelkal","Tage","Wochen","Monate","Monate+Bel","Belastung","Schuhe","Kriterien","Daten","Jahre","Strecken","Bel-Kriterien"],"not_rendered":{"charts":9,"images":28,"macros":1,"external_links":0,"defined_names":43,"comments":5,"pivot_tables":0},"unopened":[],"bounds":{"document_bytes":16777216,"sheet_cells":100000,"rows_first":2000,"rows_last":500,"rows_between":2000,"halvings":0,"cell_chars":16384,"cell_head_chars":4096},"cells_cut":0,"cells_raw":0,"read":"whole","date_system":"1900"}

{"sheet":"Begruessung","index":0,"n_rows":47,"n_cols":8,"rows_kept":47,"cut":false,"hidden":false,"merged":[[2,1,2,9],[37,1,37,9],[8,1,8,9],[6,1,6,9],[4,1,4,9],[11,3,11,5],[11,6,11,8],[12,3,12,4],[36,1,36,9],[27,1,27,9],[26,1,26,9],[25,1,25,9],[24,1,24,9],[29,1,29,9],[17,1,18,9],[20,1,20,9],[40,1,40,9],[33,1,33,4],[41,1,41,9],[46,1,46,9],[42,1,42,9],[43,1,43,9],[44,1,44,9],[45,1,45,9],[39,1,39,9],[14,5,14,9],[28,1,28,9],[38,1,38,9],[22,1,22,9],[21,1,21,9],[19,1,19,9]]}
[null,"Hi,"]
[]
[null,"nicht erschrecken, die Datei enthält natürlich Makros. Sie dienen bis auf 1 Ausnahme nur zum Navigieren. Die Ausnahme ist das Lösch-Makro, das alle Trainingsdaten entfernt. Man kann aber auch normal von Hand in der Datei navigieren. Es ist nichts versteckt (da fällt mir ein: Spalten im Laufkalenderblatt). Auf allen Arbeitsblättern habe ich sicherheitshalber einen Blattschutz aktiviert, aber ohne Paßwort. Kann über Schutz-Blattschutzaufheben deaktiviert werden."]
[]
[null,"Zur Demo habe ich ein paar Trainingsdaten eingegeben, damit Ihr die Berechnungen und Grafiken sehen könnt. Macht eine Sicherheitskopie, bevor Ihr mit dem Button im Hauptmenü (oder auch zu Fuß, wenn Ihr dem Makro nicht trauen wollt) die Testdaten löscht und Euch selbst versucht."]
[]
[null,"Die Kennziffern für die Belastung kann man im Blatt Kriterien beliebig ändern (z.Z. HF-Bereiche). Nur muss man dann bei der Eingabe der Trainingsläufe, genau wie bei den Schuhmodellen, natürlich genau dasselbe Kürzel verwenden. Das ist durch die automatische dropdown-Liste und Gültigkeitsprüfung gewährleistet."]
[]
[null,"Die Bildschirm-Anzeige ist für 1280x1024 Pixel eingestellt. Das läßt sich am einfachsten durch Änderung des Zoom-Faktors anpassen (Zoom-Faktor ist nur nutzbar, wenn Cursor in der Tabelle steht, d.h. nicht die Graphik markiert ist). Genug der Gebrauchsanweisungen, so kompliziert ist's wirklich nicht. Ach so, vielleicht paßt meine Skala in der Grafik nicht zu Eurem Trainingsumfang. Zum ändern einfach auf eine Skalenzahl doppelklicken und dann im Register Skalierung das Maximum verändern."]
[]
{"$rows_left_out":38}
{"sheet":"Menue","index":1,"n_rows":19,"n_cols":2,"rows_kept":19,"cut":false,"hidden":false,"merged":[[2,1,2,8],[10,1,10,8],[18,1,18,8]]}
[" "]
[]
[null,"Zur Datenanzeige"]
[]
[]
[]
[]
[]
[]
[]
{"$rows_left_out":10}
{"sheet":"Laufen","index":2,"n_rows":27,"n_cols":12,"rows_kept":27,"cut":false,"hidden":false,"merged":[[29,1,29,5]]}
[null,{"$f":"+\"Laufen \"&Daten!D3","v":"Laufen 2021"},"Stand",{"$f":"TODAY()","v":"2020-12-25"},"km","Anzahl","hh:mm:ss",null,"Muckibude"]
[null,"im Jahr insgesamt",null,null,{"$f":"DSUM(laufkalender,Laufkal!F5,Kriterien!$A$6:$B$7)","v":28.5},{"$f":"DCOUNT(laufkalender,Laufkal!F5,Kriterien!A6:B7)-L26","v":3},{"$f":"DSUM(laufkalender,Laufkal!L5,Kriterien!A6:B7)/24/60","v":0.10839120370370371},null,{"$f":"DCOUNT(laufkalender,Laufkal!AI5,Kriterien!$A$6:$B$7)","v":0}]
[]
[null,"Durchschnitt pro Monat",null,null,{"$f":"+E2/Daten!D11","v":{"$error":"#DIV/0!"}},{"$f":"+F2/Daten!D11","v":{"$error":"#DIV/0!"}},{"$f":"+G2/Daten!D11","v":{"$error":"#DIV/0!"}},null,{"$f":"+I2/Daten!D11","v":{"$error":"#DIV/0!"}}]
[null,"Durchschnitt pro Woche",null,null,{"$f":"(+E2+Daten!I8+Daten!I12)/Daten!D10","v":{"$error":"#DIV/0!"}},{"$f":"(+F2+Daten!I9+Daten!I13)/Daten!D10","v":{"$error":"#DIV/0!"}},{"$f":"+G2/Daten!D10","v":{"$error":"#DIV/0!"}},null,{"$f":"+I2/Daten!D10","v":{"$error":"#DIV/0!"}}]
[null,"Durchschnitt pro Tag",null,null,{"$f":"+E2/Daten!D9","v":{"$error":"#DIV/0!"}},{"$f":"+F2/Daten!D9","v":{"$error":"#DIV/0!"}},{"$f":"+G2/Daten!D9","v":{"$error":"#DIV/0!"}}]
[null,"Durchschnitt pro Lauf",null,null,{"$f":"+E2/F2","v":9.5},null,{"$f":"+G2/F2","v":"00:52:01.667"},null,"ges. seit 01/2001"]
[null,"Durchschnittstempo km/Std - m/sec - min/km",null,null,{"$f":"+E2/(G2*24)","v":10.955686065136144},{"$f":"+E2*1000/(G2*24*60*60)","v":3.0432461292044848},{"$f":"+G2/E2","v":"00:05:28.596"},null,{"$f":"+I2+Daten!E27","v":0}]
[null,"längster Lauf",null,null,{"$f":"DMAX(laufkalender,Laufkal!F5,Kriterien!A6:A7)","v":10},null,{"$f":"DMAX(laufkalender,Laufkal!L5,Kriterien!A6:B7)/24/60","v":3.9293981481481478E-2}]
[null,"kürzester Lauf",null,null,{"$f":"DMIN(laufkalender,Laufkal!F5,Kriterien!A6:A7)","v":2},null,{"$f":"DMIN(laufkalender,Laufkal!L5,Kriterien!A6:B7)/24/60","v":8.3333333333333332E-3},null,"gesamt-km"]
{"$rows_left_out":18}
{"sheet":"Laufkal","index":3,"n_rows":741,"n_cols":35,"rows_kept":741,"cut":false,"hidden":false,"merged":[[739,32,739,33],[0,0,0,2],[0,5,0,12],[739,28,739,29],[740,28,740,29],[0,22,0,23],[0,16,0,17],[1,6,1,10],[1,19,1,20],[1,22,1,23],[1,24,1,25]]}
[{"$f":"+Daten!D3","v":2021},null,null,null,null,{"$f":"+\"Jahr: \"&+ROUND(Laufen!E2,1)&\" km\"","v":"Jahr: 28,5 km"},null,null,null,null,null,null,null,"akt. Monat:",null,null,{"$f":"IF(+Daten!D3=YEAR(Daten!D8),VLOOKUP(aktuellermonat,Daten!C32:D43,2),\"---\")","v":"---"},null,"km","Vormonat:",null,null,{"$f":"IF(aktuellermonat=1,\"---\",VLOOKUP(aktuellermonat-1,Daten!C32:D43,2))","v":{"$error":"#N/A"}},null,"km"]
[null,"Mo",null,null,null,"km","Laufzeit",null,null,null,null,"min","Ø","Ø","Be-","HF","HF","Greif","Sch-","Anteil",null,"Rad","Muckibude",null,"Gewicht",null,null,"Zs","Tg","Wo","Wo","Zs","km","km","Wert"]
[null,"nat",null,null,null,null,null,null,null,null,null,null,"min/","km/","las-","Ø","%von","Pkte","uh","weich","hart","km","Ein","Anz.","in kg","BMI",null,"fsg","sum","sum","nr","fsg","weich","hart","Mu"]
["Datum",null,"Tag",null,null,null,"h",":","mm",":","ss",null,"km","Std","tung",null,"max",null,null,"1-10",null,null,"gabe","lfd.J.",null,null,"Kommentar",null,null,null,null,null,null,null,"bu"]
["datum","mo","tag","m","so","km","h",null,"mm",null,"ss","min","min/km","km/std","bel","dhf","%HF","gpkt","Schuh","weich","hart","rad",6,null,null,null,"kommentar","Zus",null,"wosum","wonr","Zusfsg","kmw","kmh","WeMu"]
[{"$f":"DATE(Daten!D3,1,1)","v":"2021-01-01"},{"$f":"MONTH(A6)","v":1},{"$f":"WEEKDAY(A6)","v":"1900-01-06"},1,{"$f":"IF(D6=2,IF(C6=1,1,2),0)","v":0},null,null,":",null,":",null,{"$f":"IF((+G6*60+I6+K6/60)>0,G6*60+I6+K6/60,\" \")","v":" "},{"$f":"IF(+F6>0,+L6/F6/24/60,\" \")","v":" "},{"$f":"IF(F6>0,+F6/(L6/60),\"\")","v":""},null,null,{"$f":"IF(maxhf<100,0,IF(ISBLANK(P6)=\"WAHR\",P6,P6/maxhf)*100)","v":0},{"$f":"IF(F6>0,IF(P6>0,+F6*(F6*1000/(G6*60+I6+K6/60))/(maxhf-P6)*(maxhf/220),\"\"),\"\")","v":""},null,null,{"$f":"IF(COUNTBLANK(T6)=1,\"\",IF(T6=\"10\",\"0\",10-T6))","v":""},{"$f":"IF(+Radelkal!F5>0,+Radelkal!F5,\"\")","v":""},null,{"$f":"IF(W6<>\"\",SUM($AI$6:AI6)/10,\"\")","v":""},null,{"$f":"IF(Y6>0,+Y6/Daten!$I$18^2,\"\")","v":""},null,null,null,{"$f":"IF(WEEKDAY(A6)=1,IF(E6=1,VLOOKUP(AE6,Daten!$C$49:$D$102,2),\" \"),\"\")","v":""},{"$f":"erstewochennr","v":0},{"$f":"IF(F6>0,IF(D6=2,IF((AB5+AB6)>0,1,0),0),0)","v":0},{"$f":"+T6/10*F6","v":0},{"$f":"IF(COUNTBLANK(T6)=1,0,+U6/10*F6)","v":0},{"$f":"IF(W6<>\"\",10,\"\")","v":""}]
[{"$f":"+A6","v":"2021-01-01"},{"$f":"MONTH(A7)","v":1},{"$f":"WEEKDAY(A7)","v":"1900-01-06"},2,{"$f":"IF(D7=2,IF(C7=1,1,2),0)","v":2},null,null,":",null,":",null,{"$f":"IF((+G7*60+I7+K7/60)>0,G7*60+I7+K7/60,\" \")","v":" "},{"$f":"IF(+F7>0,+L7/F7/24/60,\" \")","v":" "},{"$f":"IF(F7>0,+F7/(L7/60),\"\")","v":""},null,null,0,"",null,null,"",{"$f":"IF(+Radelkal!F6>0,+Radelkal!F6,\"\")","v":20},null,{"$f":"IF(W7<>\"\",SUM($AI$6:AI7)/10,\"\")","v":""},null,{"$f":"IF(Y7>0,+Y7/Daten!$I$18^2,\"\")","v":""},null,null,{"$f":"IF(D7=2,+F7+F6,0)","v":0},{"$f":"IF(WEEKDAY(A7)=1,IF(E7=1,VLOOKUP(AE7,Daten!$C$49:$D$102,2),\" \"),\"\")","v":""},{"$f":"erstewochennr","v":0},{"$f":"IF(F7>0,IF(D7=2,IF((AB6+AB7)>0,1,0),0),0)","v":0},{"$f":"+T7/10*F7","v":0},{"$f":"IF(COUNTBLANK(T7)=1,0,+U7/10*F7)","v":0},{"$f":"IF(W7<>\"\",10,\"\")","v":""}]
[{"$f":"+A6+1","v":"2021-01-02"},1,"1900-01-07",1,0,10,null,":",56,":",35,56.583333333333336,"00:05:39.500",10.603829160530191,"L>65%",115,73.248407643312092,30.028881280722224,"s1",5,5,{"$f":"IF(+Radelkal!F7>0,+Radelkal!F7,\"\")","v":""},null,{"$f":"IF(W8<>\"\",SUM($AI$6:AI8)/10,\"\")","v":""},67,{"$f":"IF(Y8>0,+Y8/Daten!$I$18^2,\"\")","v":21.629648760330578},"Texteingabe möglich oder Strecke aus Liste wählen",null,{"$f":"IF(D8=2,+F8+F7,0)","v":0},{"$f":"IF(WEEKDAY(A8)=1,IF(E8=1,VLOOKUP(AE8,Daten!$C$49:$D$102,2),\" \"),\"\")","v":""},{"$f":"IF(WEEKDAY(A8)=2,IF(D8=1,AE7+1,AE7),AE7)","v":0},0,5,5,""]
[{"$f":"+A8","v":"2021-01-02"},1,"1900-01-07",2,2,null,null,":",null,":",null," "," ","",null,null,0,"",null,null,"",{"$f":"IF(+Radelkal!F8>0,+Radelkal!F8,\"\")","v":""},null,{"$f":"IF(W9<>\"\",SUM($AI$6:AI9)/10,\"\")","v":""},null,{"$f":"IF(Y9>0,+Y9/Daten!$I$18^2,\"\")","v":""},null,null,10,{"$f":"IF(WEEKDAY(A9)=1,IF(E9=1,VLOOKUP(AE9,Daten!$C$49:$D$102,2),\" \"),\"\")","v":""},0,0,0,0,""]
[{"$f":"+A8+1","v":"2021-01-03"},1,"1900-01-01",1,0,6.5,null,":",45,":",0,45,"00:06:55.385",8.6666666666666661,"R<65%",100,63.694267515923563,11.754828991671095,"s2",0,10,{"$f":"IF(+Radelkal!F9>0,+Radelkal!F9,\"\")","v":""},null,{"$f":"IF(W10<>\"\",SUM($AI$6:AI10)/10,\"\")","v":""},null,{"$f":"IF(Y10>0,+Y10/Daten!$I$18^2,\"\")","v":""},null,null,0,{"$f":"IF(WEEKDAY(A10)=1,IF(E10=1,VLOOKUP(AE10,Daten!$C$49:$D$102,2),\" \"),\"\")","v":" "},0,0,0,6.5,""]
{"$rows_left_out":732}
{"sheet":"Radeln","index":4,"n_rows":20,"n_cols":10,"rows_kept":20,"cut":false,"hidden":false,"merged":[]}
[{"$f":"+\"Radeln \" &Daten!D3","v":"Radeln 2021"},null,null,"km","Anzahl","HM","hh:mm"]
["im Jahr insgesamt",null,null,{"$f":"DSUM(radelkalender,Radelkal!F4,Kriterien!$G$6:$H$7)","v":20},{"$f":"DCOUNT(radelkalender,Radelkal!F4,Kriterien!G6:H7)","v":1},{"$f":"DSUM(radelkalender,Radelkal!M4,Kriterien!G6:H7)","v":0},{"$f":"DSUM(radelkalender,Radelkal!J4,Kriterien!G6:H7)/24/60","v":4.1666666666666664E-2},null,null,"gesamt-km"]
[null,null,null,null,null,null,null,null,null,"seit 03/95"]
["Durchschnitt pro Monat",null,null,{"$f":"+D2/Daten!D11","v":{"$error":"#DIV/0!"}},{"$f":"+E2/Daten!D11","v":{"$error":"#DIV/0!"}},null,{"$f":"+G2/Daten!D11","v":{"$error":"#DIV/0!"}},null,null,{"$f":"+Daten!D27+D2","v":20}]
["Durchschnitt pro Woche",null,null,{"$f":"(+D2)/Daten!D10","v":{"$error":"#DIV/0!"}},{"$f":"+E2/Daten!D10","v":{"$error":"#DIV/0!"}},null,{"$f":"+G2/Daten!D10","v":{"$error":"#DIV/0!"}}]
["Durchschnitt pro Tag",null,null,{"$f":"+D2/Daten!D9","v":{"$error":"#DIV/0!"}},{"$f":"+E2/Anzahltage","v":{"$error":"#DIV/0!"}},null,{"$f":"+G2/Anzahltage","v":{"$error":"#DIV/0!"}},null,null,"Höchstkm/h"]
["Durchschnitt pro Radtour",null,null,{"$f":"+D2/E2","v":20},null,null,{"$f":"+G2/E2","v":4.1666666666666664E-2}]
["Durchschnitt km/Std",null,null,{"$f":"+D2/G2/24","v":20}]
["max. Durchschnitts-Km/h",null,null,{"$f":"DMAX(radelkalender,Radelkal!K4,Kriterien!G6:H7)","v":20}]
["längste Radtour",null,null,{"$f":"DMAX(radelkalender,Radelkal!F4,Kriterien!G6:H7)","v":20},null,null,{"$f":"DMAX(radelkalender,Radelkal!J4,Kriterien!G6:H7)/24/60","v":4.1666666666666664E-2}]
{"$rows_left_out":11}
{"sheet":"Radelkal","index":5,"n_rows":738,"n_cols":18,"rows_kept":738,"cut":false,"hidden":false,"merged":[[0,6,0,8],[1,6,1,8]]}
["Datum","Mo","Tag",null,null,"km","Fahrt-",null,null,"min","Ø","Be-","HM","Rad",null,"Tag","Wo","Wo"]
[null,"nat",null,null,null,null,"zeit",null,null,null,"km/","las-","berg",null,null,"sum","sum","nr"]
[null,null,null,null,null,null,"h",":","mm",null,"Std","tung","auf",null,"Kommentar","Rad","Rad"]
["datum","mo",null,null,null,"km","h",null,"mm","min","km/Std","bel","hm","rad","Kommentar","tasu","wosum","wonr"]
[{"$f":"DATE(Daten!D3,1,1)","v":"2021-01-01"},{"$f":"MONTH(A5)","v":1},{"$f":"WEEKDAY(A5)","v":"1900-01-06"},1,{"$f":"IF(D5=2,IF(C5=1,1,2),0)","v":0},null,null,":",null,{"$f":"IF((+G5*60+I5)>0,G5*60+I5,\"\")","v":""},{"$f":"IF(+F5>0,F5/J5*60,\" \")","v":" "},null,null,null,null,null,{"$f":"IF(WEEKDAY(A5)=1,IF(D5=2,VLOOKUP(R5,Daten!$C$49:$E$102,3),\" \"),\"\")","v":""},{"$f":"erstewochennr","v":0}]
[{"$f":"+A5","v":"2021-01-01"},{"$f":"MONTH(A6)","v":1},{"$f":"WEEKDAY(A6)","v":"1900-01-06"},2,{"$f":"IF(D6=2,IF(C6=1,1,2),0)","v":2},20,1,":",0,60,20,5,0,"r1","Heimtrainer",{"$f":"IF(D6=2,+F6+F5,0)","v":20},{"$f":"IF(WEEKDAY(A6)=1,IF(D6=2,VLOOKUP(R6,Daten!$C$49:$E$102,3),\" \"),\"\")","v":""},{"$f":"erstewochennr","v":0}]
[{"$f":"+A5+1","v":"2021-01-02"},1,"1900-01-07",1,0,null,null,":",null,""," ",null,null,null,null,{"$f":"IF(D7=2,+F7+F6,0)","v":0},{"$f":"IF(WEEKDAY(A7)=1,IF(D7=2,VLOOKUP(R7,Daten!$C$49:$E$102,3),\" \"),\"\")","v":""},{"$f":"IF(WEEKDAY(A7)=2,IF(D7=1,R6+1,R6),R6)","v":0}]
[{"$f":"+A7","v":"2021-01-02"},1,"1900-01-07",2,2,null,null,":",null,""," ",null,null,null,null,0,{"$f":"IF(WEEKDAY(A8)=1,IF(D8=2,VLOOKUP(R8,Daten!$C$49:$E$102,3),\" \"),\"\")","v":""},0]
[{"$f":"+A7+1","v":"2021-01-03"},1,"1900-01-01",1,0,null,null,":",null,""," ",null,null,null,null,0,{"$f":"IF(WEEKDAY(A9)=1,IF(D9=2,VLOOKUP(R9,Daten!$C$49:$E$102,3),\" \"),\"\")","v":" "},0]
[{"$f":"+A9","v":"2021-01-03"},1,"1900-01-01",2,1,null,null,":",null,""," ",null,null,null,null,0,{"$f":"IF(WEEKDAY(A10)=1,IF(D10=2,VLOOKUP(R10,Daten!$C$49:$E$102,3),\" \"),\"\")","v":20},0]
{"$rows_left_out":729}
{"sheet":"Tage","index":6,"n_rows":0,"n_cols":0,"rows_kept":0,"cut":false,"hidden":false,"merged":[]}

{"sheet":"Wochen","index":7,"n_rows":0,"n_cols":0,"rows_kept":0,"cut":false,"hidden":false,"merged":[]}

{"sheet":"Monate","index":8,"n_rows":0,"n_cols":0,"rows_kept":0,"cut":false,"hidden":false,"merged":[]}

{"sheet":"Monate+Bel","index":9,"n_rows":0,"n_cols":0,"rows_kept":0,"cut":false,"hidden":false,"merged":[]}

{"sheet":"Belastung","index":10,"n_rows":0,"n_cols":0,"rows_kept":0,"cut":false,"hidden":false,"merged":[]}

{"sheet":"Schuhe","index":11,"n_rows":0,"n_cols":0,"rows_kept":0,"cut":false,"hidden":false,"merged":[]}

{"sheet":"Kriterien","index":12,"n_rows":210,"n_cols":8,"rows_kept":210,"cut":false,"hidden":false,"merged":[[24,2,24,3]]}
["Erfassung individueller Daten ist nur in",null,null,"Feldern","notwendig."]
[]
[]
["Kriterien für",null,null,null,null,null,"Kriterien für"]
["Gesamtsummen Laufen",null,null,null,null,null,"Gesamtsummen Radeln"]
["datum","datum",null,null,null,null,"datum","datum"]
[]
[]
[]
[]
{"$rows_left_out":201}
{"sheet":"Daten","index":13,"n_rows":104,"n_cols":10,"rows_kept":104,"cut":false,"hidden":false,"merged":[[29,2,29,6],[45,2,45,6]]}
["Erfassung individueller Daten ist nur in den ",null,null,null,"Feldern","notwendig."]
[]
[null,null,"Jahr eingeben:",2021,{"$f":"IF(D8<D6,\"Jahr hat noch nicht begonnen!\",\"\")","v":"Jahr hat noch nicht begonnen!"}]
[null,null,"Anfangstag:",1]
[null,null,"Anfangsmonat:",1,null,null,"Wochen-Nummer des 01.01.",null,{"$f":"IF(I7>3,0,1)","v":0}," (Woche Nr. 1 muss 4 Wochentage haben)"]
[null,null,"Jahresbeginn",{"$f":"DATE(D3,1,1)","v":"2021-01-01"},null,null,"Wochentag Jahresbeginn",null,{"$f":"WEEKDAY(D6)","v":"1900-01-06"}]
[null,null,"Anfang/Ende",{"$f":"DATE(D3,D5,D4)","v":"2021-01-01"},{"$f":"DATE(D3,12,31)","v":"2021-12-31"},null,"Wochentage vor Jahresbeginn",null,{"$f":"IF(WEEKDAY(D6)=1,6,WEEKDAY(D6)-2)","v":4}]
[null,null,"heute",{"$f":"TODAY()","v":"2020-12-25"},{"$f":"IF(D8>E7,E7-D7+1,D8-D7+1)","v":-6},{"$f":"MONTH(D8)-D5","v":11},"darin gelaufene km Vorjahr"]
[null,null,"Anzahl Tage",{"$f":"IF(D8<D6,0,IF(E8>E7,E8-D8+1,E8))","v":0},null,null,"Anzahl Läufe Vorjahr"]
[null,null,"Anzahl Wochen",{"$f":"IF(D8<D6,0,IF(D8<E7,(D9+I7)/7,(+D9+I7+I11)/7))","v":0},null,null,"Wochentag Jahresende",null,{"$f":"WEEKDAY(E7)","v":"1900-01-06"}]
{"$rows_left_out":95}
{"sheet":"Jahre","index":14,"n_rows":0,"n_cols":0,"rows_kept":0,"cut":false,"hidden":false,"merged":[]}

{"sheet":"Strecken","index":15,"n_rows":36,"n_cols":1,"rows_kept":36,"cut":false,"hidden":false,"merged":[]}
["Laufstrecken"]
["Strecke 1"]
["Strecke 2"]
["Strecke 3"]
["Strecke 4"]
["Strecke 5"]
["Strecke 6"]
["Strecke 7"]
["Strecke 8"]
["Strecke 9"]
{"$rows_left_out":27}
{"sheet":"Bel-Kriterien","index":16,"n_rows":28,"n_cols":27,"rows_kept":28,"cut":false,"hidden":false,"merged":[]}
["Kriterien und Formeln zur Berechnung der Belastungen je Monat"]
["In diesem Blatt sind keine individuellen Änderungen notwendig.",null,null,null,null,null,null,null,null,null,null,null,null,null,1,2,3,4,5,6,7,8,9,10,11,12,"Sum"]
["mo","bel","mo","bel","mo","bel","mo","bel","mo","bel","mo","bel",null,{"$f":"+Kriterien!B26","v":"W"},{"$f":"DSUM(laufkalender,Laufkal!F5,A3:B4)","v":10},{"$f":"DSUM(laufkalender,Laufkal!$F$5,A5:B6)","v":0},{"$f":"DSUM(laufkalender,Laufkal!$F$5,A7:B8)","v":0},{"$f":"DSUM(laufkalender,Laufkal!$F$5,A9:B10)","v":0},{"$f":"DSUM(laufkalender,Laufkal!$F$5,A11:B12)","v":0},{"$f":"DSUM(laufkalender,Laufkal!$F$5,A13:B14)","v":0},{"$f":"DSUM(laufkalender,Laufkal!$F$5,A15:B16)","v":0},{"$f":"DSUM(laufkalender,Laufkal!$F$5,A17:B18)","v":0},{"$f":"DSUM(laufkalender,Laufkal!$F$5,A19:B20)","v":0},{"$f":"DSUM(laufkalender,Laufkal!$F$5,A21:B22)","v":0},{"$f":"DSUM(laufkalender,Laufkal!$F$5,A23:B24)","v":0},{"$f":"DSUM(laufkalender,Laufkal!$F$5,A25:B26)","v":0},{"$f":"SUM(O3:Z3)","v":10}]
[1,{"$f":"+Kriterien!$B$26","v":"W"},1,{"$f":"+Kriterien!$B$27","v":"T >90%"},1,{"$f":"+Kriterien!$B$28","v":"G2>80%"},1,{"$f":"+Kriterien!$B$29","v":"G1>70%"},1,{"$f":"+Kriterien!$B$30","v":"L>65%"},1,{"$f":"+Kriterien!$B$31","v":"R<65%"},null,{"$f":"+Kriterien!B27","v":"T >90%"},{"$f":"DSUM(laufkalender,Laufkal!$F$5,C3:D4)","v":0},{"$f":"DSUM(laufkalender,Laufkal!$F$5,C5:D6)","v":0},{"$f":"DSUM(laufkalender,Laufkal!$F$5,C7:D8)","v":0},{"$f":"DSUM(laufkalender,Laufkal!$F$5,C9:D10)","v":0},{"$f":"DSUM(laufkalender,Laufkal!$F$5,C11:D12)","v":0},{"$f":"DSUM(laufkalender,Laufkal!$F$5,C13:D14)","v":0},{"$f":"DSUM(laufkalender,Laufkal!$F$5,C15:D16)","v":0},{"$f":"DSUM(laufkalender,Laufkal!$F$5,C17:D18)","v":0},{"$f":"DSUM(laufkalender,Laufkal!$F$5,C19:D20)","v":0},{"$f":"DSUM(laufkalender,Laufkal!$F$5,C21:D22)","v":0},{"$f":"DSUM(laufkalender,Laufkal!$F$5,C23:D24)","v":0},{"$f":"DSUM(laufkalender,Laufkal!$F$5,C25:D26)","v":0},{"$f":"SUM(O4:Z4)","v":0}]
["mo","bel","mo","bel","mo","bel","mo","bel","mo","bel","mo","bel",null,{"$f":"+Kriterien!B28","v":"G2>80%"},{"$f":"DSUM(laufkalender,Laufkal!$F$5,E3:F4)","v":0},{"$f":"DSUM(laufkalender,Laufkal!$F$5,E5:F6)","v":0},{"$f":"DSUM(laufkalender,Laufkal!$F$5,E7:F8)","v":0},{"$f":"DSUM(laufkalender,Laufkal!$F$5,E9:F10)","v":0},{"$f":"DSUM(laufkalender,Laufkal!$F$5,E11:F12)","v":0},{"$f":"DSUM(laufkalender,Laufkal!$F$5,E13:F14)","v":0},{"$f":"DSUM(laufkalender,Laufkal!$F$5,E15:F16)","v":0},{"$f":"DSUM(laufkalender,Laufkal!$F$5,E17:F18)","v":0},{"$f":"DSUM(laufkalender,Laufkal!$F$5,E19:F20)","v":0},{"$f":"DSUM(laufkalender,Laufkal!$F$5,E21:F22)","v":0},{"$f":"DSUM(laufkalender,Laufkal!$F$5,E23:F24)","v":0},{"$f":"DSUM(laufkalender,Laufkal!$F$5,E25:F26)","v":0},0]
[2,{"$f":"+Kriterien!$B$26","v":"W"},2,{"$f":"+Kriterien!$B$27","v":"T >90%"},2,{"$f":"+Kriterien!$B$28","v":"G2>80%"},2,{"$f":"+Kriterien!$B$29","v":"G1>70%"},2,{"$f":"+Kriterien!$B$30","v":"L>65%"},2,{"$f":"+Kriterien!$B$31","v":"R<65%"},null,{"$f":"+Kriterien!B29","v":"G1>70%"},{"$f":"DSUM(laufkalender,Laufkal!$F$5,G3:H4)","v":0},{"$f":"DSUM(laufkalender,Laufkal!$F$5,G5:H6)","v":0},{"$f":"DSUM(laufkalender,Laufkal!$F$5,G7:H8)","v":0},{"$f":"DSUM(laufkalender,Laufkal!$F$5,G9:H10)","v":0},{"$f":"DSUM(laufkalender,Laufkal!$F$5,G11:H12)","v":0},{"$f":"DSUM(laufkalender,Laufkal!$F$5,G13:H14)","v":0},{"$f":"DSUM(laufkalender,Laufkal!$F$5,G15:H16)","v":0},{"$f":"DSUM(laufkalender,Laufkal!$F$5,G17:H18)","v":0},{"$f":"DSUM(laufkalender,Laufkal!$F$5,G19:H20)","v":0},{"$f":"DSUM(laufkalender,Laufkal!$F$5,G21:H22)","v":0},{"$f":"DSUM(laufkalender,Laufkal!$F$5,G23:H24)","v":0},{"$f":"DSUM(laufkalender,Laufkal!$F$5,G25:H26)","v":0},0]
["mo","bel","mo","bel","mo","bel","mo","bel","mo","bel","mo","bel",null,{"$f":"+Kriterien!B30","v":"L>65%"},{"$f":"DSUM(laufkalender,Laufkal!$F$5,I3:J4)","v":12},{"$f":"DSUM(laufkalender,Laufkal!$F$5,I5:J6)","v":0},{"$f":"DSUM(laufkalender,Laufkal!$F$5,I7:J8)","v":0},{"$f":"DSUM(laufkalender,Laufkal!$F$5,I9:J10)","v":0},{"$f":"DSUM(laufkalender,Laufkal!$F$5,I11:J12)","v":0},{"$f":"DSUM(laufkalender,Laufkal!$F$5,I13:J14)","v":0},{"$f":"DSUM(laufkalender,Laufkal!$F$5,I15:J16)","v":0},{"$f":"DSUM(laufkalender,Laufkal!$F$5,I17:J18)","v":0},{"$f":"DSUM(laufkalender,Laufkal!$F$5,I19:J20)","v":0},{"$f":"DSUM(laufkalender,Laufkal!$F$5,I21:J22)","v":0},{"$f":"DSUM(laufkalender,Laufkal!$F$5,I23:J24)","v":0},{"$f":"DSUM(laufkalender,Laufkal!$F$5,I25:J26)","v":0},12]
[3,{"$f":"+Kriterien!$B$26","v":"W"},3,{"$f":"+Kriterien!$B$27","v":"T >90%"},3,{"$f":"+Kriterien!$B$28","v":"G2>80%"},3,{"$f":"+Kriterien!$B$29","v":"G1>70%"},3,{"$f":"+Kriterien!$B$30","v":"L>65%"},3,{"$f":"+Kriterien!$B$31","v":"R<65%"},null,{"$f":"+Kriterien!B31","v":"R<65%"},{"$f":"DSUM(laufkalender,Laufkal!$F$5,K3:L4)","v":6.5},{"$f":"DSUM(laufkalender,Laufkal!$F$5,K5:L6)","v":0},{"$f":"DSUM(laufkalender,Laufkal!$F$5,K7:L8)","v":0},{"$f":"DSUM(laufkalender,Laufkal!$F$5,K9:L10)","v":0},{"$f":"DSUM(laufkalender,Laufkal!$F$5,K11:L12)","v":0},{"$f":"DSUM(laufkalender,Laufkal!$F$5,K13:L14)","v":0},{"$f":"DSUM(laufkalender,Laufkal!$F$5,K15:L16)","v":0},{"$f":"DSUM(laufkalender,Laufkal!$F$5,K17:L18)","v":0},{"$f":"DSUM(laufkalender,Laufkal!$F$5,K19:L20)","v":0},{"$f":"DSUM(laufkalender,Laufkal!$F$5,K21:L22)","v":0},{"$f":"DSUM(laufkalender,Laufkal!$F$5,K23:L24)","v":0},{"$f":"DSUM(laufkalender,Laufkal!$F$5,K25:L26)","v":0},6.5]
["mo","bel","mo","bel","mo","bel","mo","bel","mo","bel","mo","bel",null,"Sum",{"$f":"SUM(O3:O8)","v":28.5},{"$f":"SUM(P3:P8)","v":0},0,0,0,0,0,0,0,0,0,0,28.5]
[4,{"$f":"+Kriterien!$B$26","v":"W"},4,{"$f":"+Kriterien!$B$27","v":"T >90%"},4,{"$f":"+Kriterien!$B$28","v":"G2>80%"},4,{"$f":"+Kriterien!$B$29","v":"G1>70%"},4,{"$f":"+Kriterien!$B$30","v":"L>65%"},4,{"$f":"+Kriterien!$B$31","v":"R<65%"}]
{"$rows_left_out":18}